BDBM50080228 (S)-3-(3-Methyl-butyrylamino)-2-oxo-4-phenyl-N-[2-(5-pyridin-2-yl-thiophene-2-sulfonylamino)-ethyl]-butyramide::CHEMBL307883
SMILES CC(C)CC(=O)N[C@@H](Cc1ccccc1)C(=O)C(=O)NCCNS(=O)(=O)c1ccc(s1)-c1ccccn1
InChI Key InChIKey=YRALXJNJWTYGEW-NRFANRHFSA-N
Data  1 KI
  Tab Delimited (TSV)   2D SDfile   Computed 3D by Vconf -m prep SDfile
Find this compound or compounds like it in BindingDB:
Activity Spreadsheet -- Enzyme Inhibition Constant Data from BindingDB
Found 1 hit for monomerid = 50080228
TargetCalpain-1 catalytic subunit(Homo sapiens (Human))
Cephalon
Curated by ChEMBL
LigandPNGBDBM50080228((S)-3-(3-Methyl-butyrylamino)-2-oxo-4-phenyl-N-[2-...)
Affinity DataKi:  420nM. Assay description: Inhibitory activity against recombinant human Calpain 1
In DepthDetails ArticlePubMed