BDBM50080836 4-[2-[2-(3-Amino-benzyloxycarbonylamino)-3-(4-phosphonooxy-phenyl)-propionylamino]-2-(1,2-dicarbamoyl-ethylcarbamoyl)-propyl]-benzoic acid::CHEMBL409262
SMILES CC(Cc1ccc(cc1)C(O)=O)(NC(=O)C(Cc1ccc(OP(O)(O)=O)cc1)NC(=O)OCc1cccc(N)c1)C(=O)NC(CC(N)=O)C(N)=O
InChI Key InChIKey=ZSFMNJDMACNKQW-UHFFFAOYSA-N
Data  1 IC50  1 Kd
  Tab Delimited (TSV)   2D SDfile   Computed 3D by Vconf -m prep SDfile
Find this compound or compounds like it in BindingDB:
Activity Spreadsheet -- Enzyme Inhibition Constant Data from BindingDB
Found 2 hits for monomerid = 50080836
TargetGrowth factor receptor-bound protein 2(Homo sapiens (Human))
University Of Paris
Curated by ChEMBL
LigandPNGBDBM50080836(4-[2-[2-(3-Amino-benzyloxycarbonylamino)-3-(4-phos...)
Affinity DataKd:  45nM. Assay description: The copound was tested on a LS250B Perkin-Elmer fluorimeter for Growth factor receptor bound protein 2 equilibrium constant(Kd) by the Michaelis-Ment...
In DepthDetails ArticlePubMed
TargetGrowth factor receptor-bound protein 2(Homo sapiens (Human))
University Of Paris
Curated by ChEMBL
LigandPNGBDBM50080836(4-[2-[2-(3-Amino-benzyloxycarbonylamino)-3-(4-phos...)
Affinity DataIC50:  153nM. Assay description: The compound was evaluated for its potency to inhibit the interaction between Growth factor receptor bound protein 2 and phosphotyrosine-containing p...
In DepthDetails ArticlePubMed