BDBM50081706 5-Methoxy-3-(1-methyl-pyrrolidin-3-yl)-1H-indole::CHEMBL132592
SMILES COc1ccc2[nH]cc(C3CCN(C)C3)c2c1
InChI Key InChIKey=ISLZNKXLIRVSJS-UHFFFAOYSA-N
Data  1 KI
  Tab Delimited (TSV)   2D SDfile   Computed 3D by Vconf -m prep SDfile
Find this compound or compounds like it in BindingDB:
Activity Spreadsheet -- Enzyme Inhibition Constant Data from BindingDB
Found 1 hit for monomerid = 50081706
Target5-hydroxytryptamine receptor 2A(Rattus norvegicus (rat))
Purdue University
Curated by ChEMBL
LigandPNGBDBM50081706(5-Methoxy-3-(1-methyl-pyrrolidin-3-yl)-1H-indole |...)
Affinity DataKi:  1.30E+3nM. Assay description: Compound was tested for binding affinity using [3H]-MDL-100,907 at 5-hydroxytryptamine 2A receptor sites in rat cortical homogenate.
In DepthDetails ArticlePubMed