BDBM50082466 CHEMBL423366::[2-(4-Benzoyl-benzenesulfonyl)-1,2,3,4-tetrahydro-isoquinolin-3-yl]-oxo-acetic acid
SMILES OC(=O)C(=O)C1Cc2ccccc2CN1S(=O)(=O)c1ccc(cc1)C(=O)c1ccccc1
InChI Key InChIKey=QZGLUUHBLOQISE-UHFFFAOYSA-N
Data  2 IC50
  Tab Delimited (TSV)   2D SDfile   Computed 3D by Vconf -m prep SDfile
Find this compound or compounds like it in BindingDB:
Activity Spreadsheet -- Enzyme Inhibition Constant Data from BindingDB
Found 2 hits for monomerid = 50082466
TargetStromelysin-1(Homo sapiens (Human))
Hoechst Marion Roussel
Curated by ChEMBL
LigandPNGBDBM50082466(CHEMBL423366 | [2-(4-Benzoyl-benzenesulfonyl)-1,2,...)
Affinity DataIC50:  3.00E+3nM. Assay description: Inhibitory concentration of the compound against human matrix metalloproteinase-3 (MMP-3)
In DepthDetails ArticlePubMed
TargetNeutrophil collagenase(Homo sapiens (Human))
Hoechst Marion Roussel
Curated by ChEMBL
LigandPNGBDBM50082466(CHEMBL423366 | [2-(4-Benzoyl-benzenesulfonyl)-1,2,...)
Affinity DataIC50:  300nM. Assay description: Inhibitory concentration against human matrix metalloproteinase-8 (human neutrophil collagenase, MMP-8)
In DepthDetails ArticlePubMed