BDBM50083523 (1-Benzyl-1H-quinolin-4-ylidene)-pentyl-amine::CHEMBL281622::CP-339818::[1-Benzyl-1H-quinolin-(4E)-ylidene]-pentyl-amine
SMILES CCCCC\N=c1/ccn(Cc2ccccc2)c2ccccc12
InChI Key InChIKey=MMGAVKCAGQCFHS-LSDHQDQOSA-N
Data  2 IC50
  Tab Delimited (TSV)   2D SDfile   Computed 3D by Vconf -m prep SDfile
Find this compound or compounds like it in BindingDB:
Activity Spreadsheet -- Enzyme Inhibition Constant Data from BindingDB
Found 2 hits for monomerid = 50083523
TargetPotassium voltage-gated channel subfamily A member 3(Mus musculus)
University Of Kiel
Curated by ChEMBL
LigandPNGBDBM50083523((1-Benzyl-1H-quinolin-4-ylidene)-pentyl-amine | CH...)
Affinity DataIC50:  230nM. Assay description: Blockade of peak steady-state K+ currents of voltage-gated potassium channel subunit Kv1.3 in mouse fibroblasts L929 at 50 uM
In DepthDetails ArticlePubMed
TargetPotassium voltage-gated channel subfamily A member 3(Homo sapiens (Human))
University Of California
Curated by ChEMBL
LigandPNGBDBM50083523((1-Benzyl-1H-quinolin-4-ylidene)-pentyl-amine | CH...)
Affinity DataIC50:  200nM. Assay description: Displacement of [125I]- ChTX from human T cell voltage-gated potassium channel subunit Kv1.3
In DepthDetails ArticlePubMed