BDBM50083535 1-Methyl-4-naphthalen-1-yl-piperidine-4-carbonitrile::CHEMBL324465
SMILES CN1CCC(CC1)(C#N)c1cccc2ccccc12
InChI Key InChIKey=KJGHRSCIVZCKKP-UHFFFAOYSA-N
Data  2 KI
  Tab Delimited (TSV)   2D SDfile   Computed 3D by Vconf -m prep SDfile
Find this compound or compounds like it in BindingDB:
Activity Spreadsheet -- Enzyme Inhibition Constant Data from BindingDB
Found 2 hits for monomerid = 50083535
TargetSodium-dependent serotonin transporter(Rattus norvegicus (rat))
University Of New Orleans
Curated by ChEMBL
LigandPNGBDBM50083535(1-Methyl-4-naphthalen-1-yl-piperidine-4-carbonitri...)
Affinity DataKi:  1.02E+3nM. Assay description: Displacement of [3H]-paroxetine from serotonin transporter (SERT)
In DepthDetails ArticlePubMed
TargetSodium-dependent dopamine transporter(Rattus norvegicus (rat))
University Of New Orleans
Curated by ChEMBL
LigandPNGBDBM50083535(1-Methyl-4-naphthalen-1-yl-piperidine-4-carbonitri...)
Affinity DataKi:  1.60E+4nM. Assay description: Displacement of [3H]-WIN- 35,428 from dopamine transporter (DAT)
In DepthDetails ArticlePubMed