BDBM50084980 (+)-taxifolin::(-)-Epicatechol::(2R,3R)-(-)-Epicatechin::(2R,3R)-2-(3,4-dihydroxyphenyl)-2,3-dihydro-3,5,7-trihydroxy-4H-1-benzopyran-4-one::(2R,3R)-2-(3,4-dihydroxyphenyl)-3,4-dihydro-2H-chromene-3,5,7-triol(2R,3R)-2-(3,4-dihydroxyphenyl)-3,5,7-trihydroxy-2,3-dihydro-4H-chromen-4-one::(2R,3R)-dihydroquercetin::(2R-trans)-2-(3,4-dihydroxyphenyl)-2,3-dihydro-3,5,7-trihydroxy-4-benzopyrone::CHEMBL66::L-Epicatechin
SMILES OC1C(=O)[C@H](Oc2cc(O)cc(O)c12)c1ccc(O)c(O)c1
InChI Key InChIKey=BYVWXQRJRYELNP-AWKYBWMHSA-N
Data  2 KI  9 IC50
  Tab Delimited (TSV)   2D SDfile   Computed 3D by Vconf -m prep SDfile
Find this compound or compounds like it in BindingDB:
Activity Spreadsheet -- Enzyme Inhibition Constant Data from BindingDB
Found 11 hits for monomerid = 50084980
TargetPolyphenol oxidase 2(Agaricus bisporus (Common mushroom))
Gyeongsang National University
Curated by ChEMBL
LigandPNGBDBM50084980((+)-taxifolin | (-)-Epicatechol | (2R,3R)-(-)-Epic...)
Affinity DataKi:  8.50E+3nM. Assay description: Competitive type inhibition of monophenolase activity of mushroom tyrosinase assessed as reduction in dopachrome formation using L-Tyrosine substrate...
In DepthDetails ArticlePubMed
TargetPolyphenol oxidase 2(Agaricus bisporus (Common mushroom))
Gyeongsang National University
Curated by ChEMBL
LigandPNGBDBM50084980((+)-taxifolin | (-)-Epicatechol | (2R,3R)-(-)-Epic...)
Affinity DataKi:  3.45E+4nM. Assay description: Competitive type inhibition of diphenolase activity of mushroom tyrosinase assessed as reduction in dopachrome formation using L-DOPA substrate by UV...
In DepthDetails ArticlePubMed
TargetMast/stem cell growth factor receptor Kit(Homo sapiens (Human))
Sejong University
Curated by ChEMBL
LigandPNGBDBM50084980((+)-taxifolin | (-)-Epicatechol | (2R,3R)-(-)-Epic...)
Affinity DataIC50:  2.19E+4nM. Assay description: Inhibition of wild type His-tagged c-KIT (544 to 976 amino acids) (unknown origin) expressed in insect cells using poly[Glu:Tyr] (4:1) as substrate p...
In DepthDetails ArticlePubMed
TargetBeta-secretase 1(Homo sapiens (Human))
Kyungpook National University
Curated by ChEMBL
LigandPNGBDBM50084980((+)-taxifolin | (-)-Epicatechol | (2R,3R)-(-)-Epic...)
Affinity DataIC50:  3.50E+4nM. Assay description: Inhibition of human Beta-secretase 1
In DepthDetails ArticlePubMed
TargetBeta-secretase 1(Homo sapiens (Human))
Kyungpook National University
Curated by ChEMBL
LigandPNGBDBM50084980((+)-taxifolin | (-)-Epicatechol | (2R,3R)-(-)-Epic...)
Affinity DataIC50:  3.00E+4nM. Assay description: Inhibition of human Beta-secretase 1
In DepthDetails ArticlePubMed
TargetPyruvate kinase PKM(Homo sapiens (Human))
Central University Of Punjab
Curated by ChEMBL
LigandPNGBDBM50084980((+)-taxifolin | (-)-Epicatechol | (2R,3R)-(-)-Epic...)
Affinity DataIC50:  1.16E+3nM. Assay description: Inhibition of recombinant PKM2 (unknown origin) Asp178, Asp177, Hie78, Lys367, Asn75, Il61, Ser362, Gly128 residues
In DepthDetails PubMed
TargetPolyphenol oxidase 2(Agaricus bisporus (Common mushroom))
Gyeongsang National University
Curated by ChEMBL
LigandPNGBDBM50084980((+)-taxifolin | (-)-Epicatechol | (2R,3R)-(-)-Epic...)
Affinity DataIC50:  2.70E+4nM. Assay description: Inhibition of diphenolase activity of mushroom tyrosinase assessed as reduction in dopachrome formation using L-DOPA substrate by UV-Vis spectrophoto...
In DepthDetails ArticlePubMed
TargetPolyphenol oxidase 2(Agaricus bisporus (Common mushroom))
Gyeongsang National University
Curated by ChEMBL
LigandPNGBDBM50084980((+)-taxifolin | (-)-Epicatechol | (2R,3R)-(-)-Epic...)
Affinity DataIC50:  2.30E+4nM. Assay description: Inhibition of monophenolase activity of mushroom tyrosinase assessed as reduction in dopachrome formation using L-Tyrosine substrate by UV-Vis spectr...
In DepthDetails ArticlePubMed
TargetMast/stem cell growth factor receptor Kit(Homo sapiens (Human))
Sejong University
Curated by ChEMBL
LigandPNGBDBM50084980((+)-taxifolin | (-)-Epicatechol | (2R,3R)-(-)-Epic...)
Affinity DataIC50:  1.57E+4nM. Assay description: Inhibition of N-terminal GST-His-tagged c-KIT (544 to 976 amino acids) D816V mutant (unknown origin) expressed in Sf9 insect cells using poly[Glu:Tyr...
In DepthDetails ArticlePubMed
TargetAmyloid-beta precursor protein(Homo sapiens (Human))
Kyoto University
Curated by ChEMBL
LigandPNGBDBM50084980((+)-taxifolin | (-)-Epicatechol | (2R,3R)-(-)-Epic...)
Affinity DataIC50:  3.30E+4nM. Assay description: Inhibition of wild type Amyloid beta (1 to 42) (unknown origin) aggregation by Thioflavin-T fluorescence assay
In DepthDetails ArticlePubMed
LigandPNGBDBM50084980((+)-taxifolin | (-)-Epicatechol | (2R,3R)-(-)-Epic...)
Affinity DataIC50: >1.00E+5nM. Assay description: Inhibitory activity against protein kinase C (PKC)
In DepthDetails Article