BDBM50085753 CHEMBL409996::cyclo(1-3)Ac-D-Glu-D-Cpa-D-Dbu-Ser-Tyr-D-Nal-Leu-Arg-Pro-D-Ala-NH2
SMILES CCCCC1CC(NC(=O)CCC(NC(C)=O)C(=O)N[C@H](Cc2ccc(Cl)cc2)C(=O)N1)C(=O)N[C@@H](CO)C(=O)N[C@@H](Cc1ccc(O)cc1)C(=O)NC(Cc1ccc2ccccc2c1)C(=O)N[C@H](CC(C)C)C(=O)N[C@@H](CCCNC(N)=N)C(=O)N1CCC[C@@H]1C(=O)NC(C)C(N)=O
InChI Key InChIKey=DNYDYJXYGMRNAU-RRGKZTCWSA-N
Data  1 KI
  Tab Delimited (TSV)   2D SDfile   Computed 3D by Vconf -m prep SDfile
Find this compound or compounds like it in BindingDB:
Activity Spreadsheet -- Enzyme Inhibition Constant Data from BindingDB
Found 1 hit for monomerid = 50085753
TargetGonadotropin-releasing hormone receptor(Rattus norvegicus)
Salk Institute
Curated by ChEMBL
LigandPNGBDBM50085753(CHEMBL409996 | cyclo(1-3)Ac-D-Glu-D-Cpa-D-Dbu-Ser-...)
Affinity DataKi:  0.310nM. Assay description: Competitive radioligand binding assay for rat Gonadotropin-releasing hormone receptor cells stably transfected in human HEK-293
In DepthDetails ArticlePubMed