BDBM50085989 CHEMBL428827::N-{4-(Biphenyl-2-yloxy)-1-[2-(4-fluoro-benzoyl)-benzoyl]-pyrrolidin-2-ylmethyl}-4-(4-oxo-2-thioxo-thiazolidin-5-ylidenemethyl)-benzamide
SMILES Fc1ccc(cc1)C(=O)c1ccccc1C(=O)N1C[C@@H](C[C@H]1CNC(=O)c1ccc(C=C2SC(S)=NC2=O)cc1)Oc1ccccc1-c1ccccc1
InChI Key InChIKey=IXWOZWSRUIASSZ-AJQTZOPKSA-N
Data  1 IC50
  Tab Delimited (TSV)   2D SDfile   Computed 3D by Vconf -m prep SDfile
Find this compound or compounds like it in BindingDB:
Activity Spreadsheet -- Enzyme Inhibition Constant Data from BindingDB
Found 1 hit for monomerid = 50085989
TargetCytosolic phospholipase A2(Homo sapiens (Human))
Shionogi
Curated by ChEMBL
LigandPNGBDBM50085989(CHEMBL428827 | N-{4-(Biphenyl-2-yloxy)-1-[2-(4-flu...)
Affinity DataIC50:  83nM. Assay description: Inhibition of Human cPLA2 alpha using Enzyme assay(PC/DOG assay)
In DepthDetails ArticlePubMed