BDBM50085990 CHEMBL268434::N-{4-(Biphenyl-2-ylmethylsulfanyl)-1-[2-(4-fluoro-benzoyl)-benzoyl]-pyrrolidin-2-ylmethyl}-4-(2,4-dioxo-thiazolidin-5-ylidenemethyl)-benzamide
SMILES OC1=NC(=O)C(S1)=Cc1ccc(cc1)C(=O)NC[C@@H]1C[C@H](CN1C(=O)c1ccccc1C(=O)c1ccc(F)cc1)SCc1ccccc1-c1ccccc1
InChI Key InChIKey=SGCFWYDGTFIUFP-SZAHLOSFSA-N
Data  1 IC50
  Tab Delimited (TSV)   2D SDfile   Computed 3D by Vconf -m prep SDfile
Find this compound or compounds like it in BindingDB:
Activity Spreadsheet -- Enzyme Inhibition Constant Data from BindingDB
Found 1 hit for monomerid = 50085990
TargetCytosolic phospholipase A2(Homo sapiens (Human))
Shionogi
Curated by ChEMBL
LigandPNGBDBM50085990(CHEMBL268434 | N-{4-(Biphenyl-2-ylmethylsulfanyl)-...)
Affinity DataIC50:  34nM. Assay description: Inhibition of Human cPLA2 alpha using Enzyme assay(PC/DOG assay)
In DepthDetails ArticlePubMed