BDBM50085997 CHEMBL266374::N-{4-(2-Bromo-6-isobutyl-phenoxy)-1-[2-(2,4-difluoro-benzoyl)-benzoyl]-pyrrolidin-2-ylmethyl}-4-(2,4-dioxo-thiazolidin-5-ylidenemethyl)-benzamide
SMILES CC(C)Cc1cccc(Br)c1O[C@@H]1C[C@@H](CNC(=O)c2ccc(C=C3SC(O)=NC3=O)cc2)N(C1)C(=O)c1ccccc1C(=O)c1ccc(F)cc1F
InChI Key InChIKey=LELMLDBIODSMGN-WUFINQPMSA-N
Data  1 IC50
  Tab Delimited (TSV)   2D SDfile   Computed 3D by Vconf -m prep SDfile
Find this compound or compounds like it in BindingDB:
Activity Spreadsheet -- Enzyme Inhibition Constant Data from BindingDB
Found 1 hit for monomerid = 50085997
TargetCytosolic phospholipase A2(Homo sapiens (Human))
Shionogi
Curated by ChEMBL
LigandPNGBDBM50085997(CHEMBL266374 | N-{4-(2-Bromo-6-isobutyl-phenoxy)-1...)
Affinity DataIC50:  22nM. Assay description: Inhibition of Human cPLA2 alpha using Enzyme assay(PC/DOG assay)
In DepthDetails ArticlePubMed