BDBM50086249 CHEMBL3425755
SMILES CNc1nc(Cc2ccccc2)cc2CCNCCc12
InChI Key InChIKey=HFAURKSQTSLTBO-UHFFFAOYSA-N
Data  1 KI  2 EC50
  Tab Delimited (TSV)   2D SDfile   Computed 3D by Vconf -m prep SDfile
Find this compound or compounds like it in BindingDB:
Activity Spreadsheet -- Enzyme Inhibition Constant Data from BindingDB
Found 3 hits for monomerid = 50086249
Target5-hydroxytryptamine receptor 2C(Homo sapiens (Human))
University Of Cambridge
Curated by ChEMBL
LigandPNGBDBM50086249(CHEMBL3425755)
Affinity DataKi:  3nM. Assay description: Inhibition of Cy3B conjugated serotonin analogue binding to human recombinant 5-HT2C receptor expressed in Swiss mouse 3T3 cell membranes after 60 mi...
In DepthDetails ArticlePubMed
Target5-hydroxytryptamine receptor 2B(Homo sapiens (Human))
University Of Cambridge
Curated by ChEMBL
LigandPNGBDBM50086249(CHEMBL3425755)
Affinity DataEC50:  1.48E+3nM. Assay description: Agonist activity at human recombinant 5-HT2B receptor expressed in CHOK1 cells assessed as induction of Ca2+ mobilization after 1 hr by FLIPR assay
In DepthDetails ArticlePubMed
Target5-hydroxytryptamine receptor 2C(Homo sapiens (Human))
University Of Cambridge
Curated by ChEMBL
LigandPNGBDBM50086249(CHEMBL3425755)
Affinity DataEC50:  9nM. Assay description: Agonist activity at human recombinant 5-HT2C receptor expressed in Swiss mouse 3T3 cell membranes after 30 to 40 mins by GTPgammaS recruitment assay
In DepthDetails ArticlePubMed