BDBM50087242 CHEMBL422705::Pro-Ser-pTyr-Val-Asn-Val-Gln-Asn
SMILES CC(C)[C@H](NC(=O)[C@H](CC(N)=O)NC(=O)[C@@H](NC(=O)[C@H](Cc1ccc(OP(O)(O)=O)cc1)NC(=O)[C@H](CO)NC(=O)[C@@H]1CCCN1)C(C)C)C(=O)N[C@@H](CCC(N)=O)C(=O)N[C@@H](CC(N)=O)C(O)=O
InChI Key InChIKey=OWOWCUYLFWUPFH-FIOLWHMYSA-N
Data  1 Kd
  Tab Delimited (TSV)   2D SDfile   Computed 3D by Vconf -m prep SDfile
Find this compound or compounds like it in BindingDB:
Activity Spreadsheet -- Enzyme Inhibition Constant Data from BindingDB
Found 1 hit for monomerid = 50087242
TargetGrowth factor receptor-bound protein 2(Homo sapiens (Human))
University Of Paris
Curated by ChEMBL
LigandPNGBDBM50087242(CHEMBL422705 | Pro-Ser-pTyr-Val-Asn-Val-Gln-Asn)
Affinity DataKd:  18nM. Assay description: Dissociation constant of compound was determined from affinity of compound towards Growth factor receptor bound protein 2 measured by fluorescence
In DepthDetails ArticlePubMed