BDBM50087244 Ac-Pro-Phe-pTyr-Val-Asn-Val-Pro-NH2::CHEMBL2371245
SMILES CC(C)[C@H](NC(=O)[C@H](Cc1ccc(OP(O)(O)=O)cc1)NC(=O)[C@H](Cc1ccccc1)NC(=O)[C@@H]1CCCN1C(C)=O)C(=O)N[C@@H](CC(N)=O)C(=O)N[C@@H](C(C)C)C(=O)N1CCC[C@H]1C(N)=O
InChI Key InChIKey=FHTZBFQXLLXMBY-PLMFXFJRSA-N
Data  1 Kd
  Tab Delimited (TSV)   2D SDfile   Computed 3D by Vconf -m prep SDfile
Find this compound or compounds like it in BindingDB:
Activity Spreadsheet -- Enzyme Inhibition Constant Data from BindingDB
Found 1 hit for monomerid = 50087244
TargetGrowth factor receptor-bound protein 2(Homo sapiens (Human))
University Of Paris
Curated by ChEMBL
LigandPNGBDBM50087244(Ac-Pro-Phe-pTyr-Val-Asn-Val-Pro-NH2 | CHEMBL237124...)
Affinity DataKd:  30nM. Assay description: Dissociation constant of compound was determined from affinity of compound towards Growth factor receptor bound protein 2 measured by fluorescence
In DepthDetails ArticlePubMed