BDBM50087349 CHEMBL36860::Sodium; 3-[2-(8-hydroxy-7,8-dihydro-6H-imidazo[4,5-d][1,3]diazepin-3-yl)-ethoxy]-benzoate (1.0H2O)
SMILES OC1CNC=Nc2c1ncn2CCOc1cccc(c1)C([O-])=O
InChI Key InChIKey=QTLYKVYIGUSASN-UHFFFAOYSA-M
Data  1 KI
  Tab Delimited (TSV)   2D SDfile   Computed 3D by Vconf -m prep SDfile
Find this compound or compounds like it in BindingDB:
Activity Spreadsheet -- Enzyme Inhibition Constant Data from BindingDB
Found 1 hit for monomerid = 50087349
TargetAdenosine deaminase(Bos taurus (bovine))
Metabasis Therapeutics
Curated by ChEMBL
LigandPNGBDBM50087349(CHEMBL36860 | Sodium; 3-[2-(8-hydroxy-7,8-dihydro-...)
Affinity DataKi: >7.50E+3nM. Assay description: Inhibitory activity against calf intestinal Adenosine deaminase (ADA)
In DepthDetails ArticlePubMed