BDBM50087383 CHEMBL431512::Sodium; 3-[3-(8-hydroxy-7,8-dihydro-6H-imidazo[4,5-d][1,3]diazepin-3-yl)-propyl]-benzoate (0.25H2O)
SMILES OC1CNC=Nc2c1ncn2CCCc1cccc(c1)C([O-])=O
InChI Key InChIKey=TWAUWJHYPYCMFY-UHFFFAOYSA-M
Data  1 KI
  Tab Delimited (TSV)   2D SDfile   Computed 3D by Vconf -m prep SDfile
Find this compound or compounds like it in BindingDB:
Activity Spreadsheet -- Enzyme Inhibition Constant Data from BindingDB
Found 1 hit for monomerid = 50087383
TargetAdenosine deaminase(Bos taurus (bovine))
Metabasis Therapeutics
Curated by ChEMBL
LigandPNGBDBM50087383(CHEMBL431512 | Sodium; 3-[3-(8-hydroxy-7,8-dihydro...)
Affinity DataKi:  2.40E+3nM. Assay description: Inhibitory activity against calf intestinal Adenosine deaminase (ADA)
In DepthDetails ArticlePubMed