BDBM50088569 2-(5-Benzoyl-2-methoxy-phenyl)-propionic acid::CHEMBL74276
SMILES COc1ccc(cc1C(C)C(O)=O)C(=O)c1ccccc1
InChI Key InChIKey=PVGMTSZPGWKSKV-UHFFFAOYSA-N
Data  2 IC50
  Tab Delimited (TSV)   2D SDfile   Computed 3D by Vconf -m prep SDfile
Find this compound or compounds like it in BindingDB:
Activity Spreadsheet -- Enzyme Inhibition Constant Data from BindingDB
Found 2 hits for monomerid = 50088569
TargetProstaglandin G/H synthase 2(Homo sapiens (Human))
Laboratorios Menarini
Curated by ChEMBL
LigandPNGBDBM50088569(2-(5-Benzoyl-2-methoxy-phenyl)-propionic acid | CH...)
Affinity DataIC50:  2.80E+3nM. Assay description: Concentration required for 50% inhibition against Prostaglandin G/H synthase 2 from human
In DepthDetails ArticlePubMed
TargetProstaglandin G/H synthase 1(Homo sapiens (Human))
Laboratorios Menarini
Curated by ChEMBL
LigandPNGBDBM50088569(2-(5-Benzoyl-2-methoxy-phenyl)-propionic acid | CH...)
Affinity DataIC50:  42nM. Assay description: Concentration required for 50% inhibition against Prostaglandin G/H synthase 1 from human
In DepthDetails ArticlePubMed