BDBM50088570 (S)-2-(3-Benzoyl-phenyl)-propionic acid::(S)-2-(3-benzoylphenyl)propanoic acid::2-(3-Benzoyl-phenyl)-propionic acid::CHEMBL75435::KETOPROFEN
SMILES C[C@H](C(O)=O)c1cccc(c1)C(=O)c1ccccc1
InChI Key InChIKey=DKYWVDODHFEZIM-NSHDSACASA-N
Data  3 IC50
PDB links: 4 PDB IDs match this monomer.
  Tab Delimited (TSV)   2D SDfile   Computed 3D by Vconf -m prep SDfile
Find this compound or compounds like it in BindingDB:
Activity Spreadsheet -- Enzyme Inhibition Constant Data from BindingDB
Found 3 hits for monomerid = 50088570
TargetProstaglandin G/H synthase 1(Homo sapiens (Human))
Laboratorios Menarini
Curated by ChEMBL
LigandPNGBDBM50088570((S)-2-(3-Benzoyl-phenyl)-propionic acid | (S)-2-(3...)
Affinity DataIC50:  1.90nM. Assay description: Concentration required for 50% inhibition against Prostaglandin G/H synthase 1 from human
In DepthDetails ArticlePubMed
TargetC-X-C chemokine receptor type 1/2(Homo sapiens (Human))
Domp£
Curated by ChEMBL
LigandPNGBDBM50088570((S)-2-(3-Benzoyl-phenyl)-propionic acid | (S)-2-(3...)
Affinity DataIC50:  50nM. Assay description: Inhibition of CXCL8-induced chemotaxis in human polymorphonuclear cells
In DepthDetails ArticlePubMed
TargetProstaglandin G/H synthase 2(Homo sapiens (Human))
Laboratorios Menarini
Curated by ChEMBL
LigandPNGBDBM50088570((S)-2-(3-Benzoyl-phenyl)-propionic acid | (S)-2-(3...)
Affinity DataIC50:  27nM. Assay description: Concentration required for 50% inhibition against Prostaglandin G/H synthase 2 from human
In DepthDetails ArticlePubMed