BDBM50089044 CHEMBL17686::[4-(4-Phenylamino-quinazolin-2-ylamino)-benzyl]-phosphonic acid diethyl ester
SMILES CCOP(=O)(Cc1ccc(Nc2nc(Nc3ccccc3)c3ccccc3n2)cc1)OCC
InChI Key InChIKey=WWXDOAVTZMDWIQ-UHFFFAOYSA-N
Data  1 IC50
  Tab Delimited (TSV)   2D SDfile   Computed 3D by Vconf -m prep SDfile
Find this compound or compounds like it in BindingDB:
Activity Spreadsheet -- Enzyme Inhibition Constant Data from BindingDB
Found 1 hit for monomerid = 50089044
TargetNeuropeptide Y receptor type 5(Homo sapiens (Human))
Novartis Pharma
Curated by ChEMBL
LigandPNGBDBM50089044(CHEMBL17686 | [4-(4-Phenylamino-quinazolin-2-ylami...)
Affinity DataIC50:  33nM. Assay description: Antagonistic activity against neuropeptide Y receptor type 5 subtype stably expressed in LM(tk-)cells
In DepthDetails ArticlePubMed