BDBM50089052 Benzoic acid 4-(4-phenylamino-quinazolin-2-ylamino)-cyclohexyl ester::CHEMBL17496
SMILES O=C(O[C@H]1CC[C@@H](CC1)Nc1nc(Nc2ccccc2)c2ccccc2n1)c1ccccc1
InChI Key InChIKey=GSYQNPWHUNGFJL-HZCBDIJESA-N
Data  1 IC50
  Tab Delimited (TSV)   2D SDfile   Computed 3D by Vconf -m prep SDfile
Find this compound or compounds like it in BindingDB:
Activity Spreadsheet -- Enzyme Inhibition Constant Data from BindingDB
Found 1 hit for monomerid = 50089052
TargetNeuropeptide Y receptor type 5(Homo sapiens (Human))
Novartis Pharma
Curated by ChEMBL
LigandPNGBDBM50089052(Benzoic acid 4-(4-phenylamino-quinazolin-2-ylamino...)
Affinity DataIC50:  400nM. Assay description: Antagonistic activity against neuropeptide Y receptor type 5 subtype stably expressed in LM(tk-)cells
In DepthDetails ArticlePubMed