BDBM50089316 CHEMBL410068::H-Lys-Arg-Pro-Hyp-Gly-Igl-Ser-D-BT-OH(JMV1645)
SMILES NCCCCC(N)C(=O)NC(CCCNC(N)=N)C(=O)N1CCCC1C(=O)N1CC(O)CC1C(=O)NCC(=O)NC(C1Cc2ccccc2C1)C(=O)NC(CO)C(=O)N[C@@H]1CSc2ccccc2N(CC(O)=O)C1=O
InChI Key InChIKey=DSKXSKYPLRUWNI-CXKZGEHRSA-N
Data  2 KI
  Tab Delimited (TSV)   2D SDfile   Computed 3D by Vconf -m prep SDfile
Find this compound or compounds like it in BindingDB:
Activity Spreadsheet -- Enzyme Inhibition Constant Data from BindingDB
Found 2 hits for monomerid = 50089316
TargetB1 bradykinin receptor(Homo sapiens (Human))
University Of Montpellier
Curated by ChEMBL
LigandPNGBDBM50089316(CHEMBL410068 | H-Lys-Arg-Pro-Hyp-Gly-Igl-Ser-D-BT-...)
Affinity DataKi:  0.0230nM. Assay description: Binding affinity of the compound towards human cloned B1 receptor was determined using [3H]-[des-Arg10-Leu9]-kallidin as radioligand
In DepthDetails ArticlePubMed
TargetB2 bradykinin receptor(Homo sapiens (Human))
University Of Montpellier
Curated by ChEMBL
LigandPNGBDBM50089316(CHEMBL410068 | H-Lys-Arg-Pro-Hyp-Gly-Igl-Ser-D-BT-...)
Affinity DataKi:  9.16nM. Assay description: Binding affinity of the compound towards human cloned B2 receptor was determined using [3H]-BK as radioligand
In DepthDetails ArticlePubMed