BDBM50089411 CHEMBL3577993
SMILES [H][C@@]12CCCN1C(=O)[C@@]1([H])CCCN1C(=O)[C@H](Cc1ccccc1)NC(=O)[C@H](C)NC(=O)[C@H](CC(N)=O)NC(=O)C(Cc1cccc3ccccc13)NC(=O)[C@H](Cc1ccccc1)NC(=O)[C@H](CCCNC(N)=N)NC2=O
InChI Key InChIKey=FNNIXVXBPJLPNQ-JHQNEBCVSA-N
Data  2 KI  2 EC50
  Tab Delimited (TSV)   2D SDfile   Computed 3D by Vconf -m prep SDfile
Find this compound or compounds like it in BindingDB:
Activity Spreadsheet -- Enzyme Inhibition Constant Data from BindingDB
Found 4 hits for monomerid = 50089411
TargetMelanocortin receptor 4(Mus musculus)
University Of Minnesota
Curated by ChEMBL
LigandPNGBDBM50089411(CHEMBL3577993)
Affinity DataKi:  16nM. Assay description: Displacement of MTII from mouse MC4R expressed in HEK293 cells
In DepthDetails ArticlePubMed
TargetMelanocortin receptor 3(Mus musculus)
University Of Minnesota
Curated by ChEMBL
LigandPNGBDBM50089411(CHEMBL3577993)
Affinity DataKi:  2.50E+3nM. Assay description: Displacement of MTII from mouse MC3R expressed in HEK293 cells
In DepthDetails ArticlePubMed
TargetMelanocortin receptor 5(Mus musculus (Mouse))
University Of Minnesota
Curated by ChEMBL
LigandPNGBDBM50089411(CHEMBL3577993)
Affinity DataEC50: >1.00E+8nM. Assay description: Agonist activity at mouse MC5R expressed in HEK293 cells by cAMP functional bioassay
In DepthDetails ArticlePubMed
TargetMelanocyte-stimulating hormone receptor(Mus musculus)
University Of Minnesota
Curated by ChEMBL
LigandPNGBDBM50089411(CHEMBL3577993)
Affinity DataEC50:  1.27E+4nM. Assay description: Agonist activity at mouse MC1R expressed in HEK293 cells by cAMP functional bioassay
In DepthDetails ArticlePubMed