BDBM50089938 CHEMBL3581190
SMILES OC(=O)Cc1ccc(Cl)c(SC2=C(O)CC(CC2=O)c2c(Cl)cccc2Cl)c1
InChI Key InChIKey=GLICEFKSRXBJDE-UHFFFAOYSA-N
Data  1 IC50
  Tab Delimited (TSV)   2D SDfile   Computed 3D by Vconf -m prep SDfile
Find this compound or compounds like it in BindingDB:
Activity Spreadsheet -- Enzyme Inhibition Constant Data from BindingDB
Found 1 hit for monomerid = 50089938
TargetL-lactate dehydrogenase A chain(Homo sapiens (Human))
Genentech
Curated by ChEMBL
LigandPNGBDBM50089938(CHEMBL3581190)
Affinity DataIC50:  3.50E+3nM. Assay description: Inhibition of human LDH-A by biochemical assay
In DepthDetails ArticlePubMed