BDBM50091328 CHEMBL3582250
SMILES CC(C)c1cc(nn2cc(nc12)C(=O)N1CCN([C@@H](C)C1)C(=O)Cc1ccsc1)-c1ccc(F)cc1
InChI Key InChIKey=XZOOMTKVHZNCPR-SFHVURJKSA-N
Data  4 IC50
  Tab Delimited (TSV)   2D SDfile   Computed 3D by Vconf -m prep SDfile
Find this compound or compounds like it in BindingDB:
Activity Spreadsheet -- Enzyme Inhibition Constant Data from BindingDB
Found 4 hits for monomerid = 50091328
TargetProteinase-activated receptor 2(Homo sapiens (Human))
Therachem Research Medilab (India)
Curated by ChEMBL
LigandPNGBDBM50091328(CHEMBL3582250)
Affinity DataIC50: >500nM. Assay description: Antagonist activity against PAR2 in human HT29 cells assessed as inhibition of UTP-induced Ca2+ responses pre-incubated for 30 mins before UTP stimul...
In DepthDetails ArticlePubMed
TargetProteinase-activated receptor 2(Homo sapiens (Human))
Therachem Research Medilab (India)
Curated by ChEMBL
LigandPNGBDBM50091328(CHEMBL3582250)
Affinity DataIC50:  2nM. Assay description: Antagonist activity against PAR2 in human HT29 cells assessed as inhibition of SLIGKV-induced Ca2+ responses pre-incubated for 30 mins before SLIGKV ...
In DepthDetails ArticlePubMed
TargetProteinase-activated receptor 2(Homo sapiens (Human))
Therachem Research Medilab (India)
Curated by ChEMBL
LigandPNGBDBM50091328(CHEMBL3582250)
Affinity DataIC50: >500nM. Assay description: Antagonist activity against PAR2 in human HT29 cells assessed as inhibition of thrombin-induced Ca2+ responses pre-incubated for 30 mins before throm...
In DepthDetails ArticlePubMed
TargetProteinase-activated receptor 2(Homo sapiens (Human))
Therachem Research Medilab (India)
Curated by ChEMBL
LigandPNGBDBM50091328(CHEMBL3582250)
Affinity DataIC50:  5nM. Assay description: Antagonist activity against PAR2 in human HT29 cells assessed as inhibition of trypsin-induced Ca2+ responses pre-incubated for 30 mins before trypsi...
In DepthDetails ArticlePubMed