BDBM50091570 3-[2-(2-Benzyloxycarbonylamino-3-methyl-butyrylamino)-propionylamino]-4-oxo-5-(2-oxo-2H-chromen-7-yloxy)-pentanoic acid::CHEMBL322966
SMILES CC(C)[C@H](NC(=O)OCc1ccccc1)C(=O)N[C@@H](C)C(=O)NC(CC(O)=O)C(=O)COc1ccc2ccc(=O)oc2c1
InChI Key InChIKey=MHRDQOSRHFFZBJ-QYXJAZEHSA-N
Data  1 IC50  1 Kon
  Tab Delimited (TSV)   2D SDfile   Computed 3D by Vconf -m prep SDfile
Find this compound or compounds like it in BindingDB:
Activity Spreadsheet -- Enzyme Inhibition Constant Data from BindingDB
Found 2 hits for monomerid = 50091570
TargetCaspase-1(Homo sapiens (Human))
Basf Bioresearch
Curated by ChEMBL
LigandPNGBDBM50091570(3-[2-(2-Benzyloxycarbonylamino-3-methyl-butyrylami...)
Affinity DataKoff:  1.60E+5s-1Assay Description:Evaluated for kinetic dissociation constant (kon) for the inhibition of caspase-1.
In DepthDetails ArticlePubMed
TargetCaspase-1(Homo sapiens (Human))
Basf Bioresearch
Curated by ChEMBL
LigandPNGBDBM50091570(3-[2-(2-Benzyloxycarbonylamino-3-methyl-butyrylami...)
Affinity DataIC50:  17nM. Assay description: Dissociation constant for inhibition of caspase-1
In DepthDetails ArticlePubMed