BDBM50091619 CHEMBL3582346
SMILES CC(C)Oc1cccc(NC(=O)Nc2ccc(cc2)S(N)(=O)=O)c1
InChI Key InChIKey=CMMKZTOAXHALOB-UHFFFAOYSA-N
Data  1 KI
  Tab Delimited (TSV)   2D SDfile   Computed 3D by Vconf -m prep SDfile
Find this compound or compounds like it in BindingDB:
Activity Spreadsheet -- Enzyme Inhibition Constant Data from BindingDB
Found 1 hit for monomerid = 50091619
TargetCarbonic anhydrase 2(Homo sapiens (Human))
Emory University
Curated by ChEMBL
LigandPNGBDBM50091619(CHEMBL3582346)
Affinity DataKi:  3.90nM. Assay description: Inhibition of carbonic anhydrase-2 (unknown origin) incubated for 15 mins prior to testing by stopped-flow CO2 hydration assay
In DepthDetails ArticlePubMed