BDBM50091894 1-Phenyl-4-(2-phenyl-oxazol-4-ylmethyl)-piperazine::CHEMBL294780
SMILES C(N1CCN(CC1)c1ccccc1)c1coc(n1)-c1ccccc1
InChI Key InChIKey=YJLMHUBBYHISAU-UHFFFAOYSA-N
Data  5 KI
  Tab Delimited (TSV)   2D SDfile   Computed 3D by Vconf -m prep SDfile
Find this compound or compounds like it in BindingDB:
Activity Spreadsheet -- Enzyme Inhibition Constant Data from BindingDB
Found 5 hits for monomerid = 50091894
TargetD(4) dopamine receptor(Homo sapiens (Human))
Friedrich-Alexander University
Curated by ChEMBL
LigandPNGBDBM50091894(1-Phenyl-4-(2-phenyl-oxazol-4-ylmethyl)-piperazine...)
Affinity DataKi:  250nM. Assay description: In vitro displacement of [3H]spiperone from the recombinant human dopamine receptor D4 expressed in CHO cells
In DepthDetails ArticlePubMed
TargetD(2) dopamine receptor(Homo sapiens (Human))
Friedrich-Alexander University
Curated by ChEMBL
LigandPNGBDBM50091894(1-Phenyl-4-(2-phenyl-oxazol-4-ylmethyl)-piperazine...)
Affinity DataKi:  1.75E+3nM. Assay description: In vitro displacement of [3H]spiperone from the recombinant human dopamine receptor D2 short form expressed in CHO cells
In DepthDetails ArticlePubMed
TargetD(2) dopamine receptor(Homo sapiens (Human))
Friedrich-Alexander University
Curated by ChEMBL
LigandPNGBDBM50091894(1-Phenyl-4-(2-phenyl-oxazol-4-ylmethyl)-piperazine...)
Affinity DataKi:  3.00E+3nM. Assay description: In vitro displacement of [3H]spiperone from the recombinant human dopamine receptor D2L stably expressed in CHO cells
In DepthDetails ArticlePubMed
TargetD(3) dopamine receptor(Homo sapiens (Human))
Friedrich-Alexander University
Curated by ChEMBL
LigandPNGBDBM50091894(1-Phenyl-4-(2-phenyl-oxazol-4-ylmethyl)-piperazine...)
Affinity DataKi:  3.95E+3nM. Assay description: In vitro displacement of [3H]spiperone from the cloned human dopamine receptor D3 stably expressed in CHO cells
In DepthDetails ArticlePubMed
TargetD(1A) dopamine receptor(BOVINE)
Friedrich-Alexander University
Curated by ChEMBL
LigandPNGBDBM50091894(1-Phenyl-4-(2-phenyl-oxazol-4-ylmethyl)-piperazine...)
Affinity DataKi:  1.15E+4nM. Assay description: In vitro displacement of [3H]- SCH 23390 from the dopamine receptor D1 of bovine striatal membrane
In DepthDetails ArticlePubMed