BDBM50096963 CHEMBL3580902
SMILES Cc1cc(OCCN)ccc1Cc1ccc(N)cc1
InChI Key InChIKey=DKKXITDVHTUHMM-UHFFFAOYSA-N
Data  2 EC50
  Tab Delimited (TSV)   2D SDfile   Computed 3D by Vconf -m prep SDfile
Find this compound or compounds like it in BindingDB:
Activity Spreadsheet -- Enzyme Inhibition Constant Data from BindingDB
Found 2 hits for monomerid = 50096963
TargetTrace amine-associated receptor 1(Mus musculus (Mouse))
University Of Pisa
Curated by ChEMBL
LigandPNGBDBM50096963(CHEMBL3580902)
Affinity DataEC50:  240nM. Assay description: Agonist activity at mouse TAAR1
In DepthDetails ArticlePubMed
TargetTrace amine-associated receptor 1(Mus musculus (Mouse))
University Of Pisa
Curated by ChEMBL
LigandPNGBDBM50096963(CHEMBL3580902)
Affinity DataEC50:  240nM. Assay description: Agonist activity at mouse TAAR1 expressed in HEK293 cells coexpressing cAMP BRET biosensor assessed as induction of CAMP production after 20 mins by ...
In DepthDetails ArticlePubMed