BDBM50097920 3-[Bis-(4-fluoro-phenyl)-methoxy]-8-oxa-bicyclo[3.2.1]octane::CHEMBL3084973
SMILES [H][C@]12CC[C@]([H])(C[C@@H](C1)OC(c1ccc(F)cc1)c1ccc(F)cc1)O2
InChI Key InChIKey=IBEURBQLLHBFBQ-BWTSREIZSA-N
Data  1 IC50
  Tab Delimited (TSV)   2D SDfile   Computed 3D by Vconf -m prep SDfile
Find this compound or compounds like it in BindingDB:
Activity Spreadsheet -- Enzyme Inhibition Constant Data from BindingDB
Found 1 hit for monomerid = 50097920
TargetSodium-dependent dopamine transporter(Rattus norvegicus (rat))
Universit£
Curated by ChEMBL
LigandPNGBDBM50097920(3-[Bis-(4-fluoro-phenyl)-methoxy]-8-oxa-bicyclo[3....)
Affinity DataIC50:  2.00E+3nM. Assay description: Ability to inhibit binding of [3H]WIN-35428 to dopamine transporter in rat caudate putamen
In DepthDetails ArticlePubMed