BDBM50098828 2-[5-Amino-2-(4-fluoro-phenyl)-6-oxo-6H-pyrimidin-1-yl]-N-{1-[5-(4-methoxy-phenyl)-[1,3,4]oxadiazole-2-carbonyl]-2-methyl-propyl}-acetamide::CHEMBL282967
SMILES COc1ccc(cc1)-c1nnc(o1)C(=O)[C@@H](NC(=O)Cn1c(ncc(N)c1=O)-c1ccc(F)cc1)C(C)C
InChI Key InChIKey=SJUJFSKKKYJEMF-NRFANRHFSA-N
Data  1 KI
  Tab Delimited (TSV)   2D SDfile   Computed 3D by Vconf -m prep SDfile
Find this compound or compounds like it in BindingDB:
Activity Spreadsheet -- Enzyme Inhibition Constant Data from BindingDB
Found 1 hit for monomerid = 50098828
TargetNeutrophil elastase(Homo sapiens (Human))
Cortech
Curated by ChEMBL
LigandPNGBDBM50098828(2-[5-Amino-2-(4-fluoro-phenyl)-6-oxo-6H-pyrimidin-...)
Affinity DataKi:  21.2nM. Assay description: Binding constant derived from inhibition of elastase catalyzed hydrolysis of synthetic substrate
In DepthDetails ArticlePubMed