BDBM50098836 CHEMBL24260::N-[1-(5-tert-Butyl-[1,3,4]oxadiazole-2-carbonyl)-2-methyl-propyl]-2-[4-(1H-indol-3-ylmethyl)-2,5-dioxo-imidazolidin-1-yl]-acetamide
SMILES CC(C)[C@H](NC(=O)Cn1c(O)c(Cc2c[nH]c3ccccc23)[nH]c1=O)C(=O)c1nnc(o1)C(C)(C)C
InChI Key InChIKey=NBBWATNXCDKRBK-IBGZPJMESA-N
Data  1 KI
  Tab Delimited (TSV)   2D SDfile   Computed 3D by Vconf -m prep SDfile
Find this compound or compounds like it in BindingDB:
Activity Spreadsheet -- Enzyme Inhibition Constant Data from BindingDB
Found 1 hit for monomerid = 50098836
TargetNeutrophil elastase(Homo sapiens (Human))
Cortech
Curated by ChEMBL
LigandPNGBDBM50098836(CHEMBL24260 | N-[1-(5-tert-Butyl-[1,3,4]oxadiazole...)
Affinity DataKi:  163nM. Assay description: Binding constant derived from inhibition of elastase catalyzed hydrolysis of synthetic substrate
In DepthDetails ArticlePubMed