BDBM50099377 Aminoglycoside dimer analogue::CHEMBL3037952::Neo-Tob dimer::Tobramycin-Neomycin
SMILES NC[C@H]1O[C@H](O[C@@H]2[C@@H](N)C[C@@H](N)[C@H](O[C@H]3O[C@H](CSCCOCCSSCCOCCSC[C@H]4O[C@@H](O[C@H]5[C@H](O)[C@@H](N)C[C@@H](N)[C@@H]5O[C@H]5O[C@H](CN)[C@@H](O)[C@H](O)[C@H]5N)[C@H](O)[C@@H]4O[C@H]4OC(CN)[C@@H](O)[C@H](O)[C@H]4N)[C@@H](O)[C@H](N)[C@H]3O)[C@H]2O)[C@H](N)C[C@@H]1O
InChI Key InChIKey=XIANNABTLWJMAC-AQTKNIJUSA-N
Data  1 Kd
  Tab Delimited (TSV)   2D SDfile   Computed 3D by Vconf -m prep SDfile
Find this compound or compounds like it in BindingDB:
Activity Spreadsheet -- Enzyme Inhibition Constant Data from BindingDB
Found 1 hit for monomerid = 50099377
TargetProtein Rev(Human immunodeficiency virus 1)
Purdue University
Curated by ChEMBL
LigandPNGBDBM50099377(Aminoglycoside dimer analogue | CHEMBL3037952 | Ne...)
Affinity DataKd:  160nM. Assay description: Tetsed for the ability to bind the HIV-1 RRE-RNA construct by fluorescence anisotropy
In DepthDetails ArticlePubMed