BDBM50101335 4-Sulfamoyl-N-(4-sulfamoyl-benzyl)-benzamide::CHEMBL51506
SMILES NS(=O)(=O)c1ccc(CNC(=O)c2ccc(cc2)S(N)(=O)=O)cc1
InChI Key InChIKey=AMYPZOHWWHXUFZ-UHFFFAOYSA-N
Data  3 KI
  Tab Delimited (TSV)   2D SDfile   Computed 3D by Vconf -m prep SDfile
Find this compound or compounds like it in BindingDB:
Activity Spreadsheet -- Enzyme Inhibition Constant Data from BindingDB
Found 3 hits for monomerid = 50101335
TargetCarbonic anhydrase 2(Homo sapiens (Human))
Universit£
Curated by ChEMBL
LigandPNGBDBM50101335(4-Sulfamoyl-N-(4-sulfamoyl-benzyl)-benzamide | CHE...)
Affinity DataKi:  7nM. Assay description: Binding affinity against human carbonic anhydrase II (hCA -II)
In DepthDetails ArticlePubMed
TargetCarbonic anhydrase 4(Bos taurus (bovine))
Universit£
Curated by ChEMBL
LigandPNGBDBM50101335(4-Sulfamoyl-N-(4-sulfamoyl-benzyl)-benzamide | CHE...)
Affinity DataKi:  16nM. Assay description: Compound was evaluated for binding affinity against bovine carbonic anhydrase IV (bCA IV)
In DepthDetails ArticlePubMed
TargetCarbonic anhydrase 1(Homo sapiens (Human))
Universit£
Curated by ChEMBL
LigandPNGBDBM50101335(4-Sulfamoyl-N-(4-sulfamoyl-benzyl)-benzamide | CHE...)
Affinity DataKi:  40nM. Assay description: Binding affinity against human carbonic anhydrase I (hCA I)
In DepthDetails ArticlePubMed