BDBM50101820 (Z)-7-{(1R,2R,3R,5S)-5-Chloro-2-[(E)-(S)-4-(1-ethyl-cyclobutyl)-4-hydroxy-but-1-enyl]-3-hydroxy-cyclopentyl}-hept-5-enoic acid::CHEMBL433249
SMILES CCC1(CCC1)[C@@H](O)C\C=C\[C@H]1[C@H](O)C[C@H](Cl)[C@@H]1C\C=C/CCCC(O)=O
InChI Key InChIKey=LBIPUBVVGYRBNA-YCSFVSLASA-N
Data  5 KI  1 EC50
  Tab Delimited (TSV)   2D SDfile   Computed 3D by Vconf -m prep SDfile
Find this compound or compounds like it in BindingDB:
Activity Spreadsheet -- Enzyme Inhibition Constant Data from BindingDB
Found 6 hits for monomerid = 50101820
TargetProstaglandin E2 receptor EP2 subtype(Mus musculus (Mouse))
Minase Research Institute
Curated by ChEMBL
LigandPNGBDBM50101820((Z)-7-{(1R,2R,3R,5S)-5-Chloro-2-[(E)-(S)-4-(1-ethy...)
Affinity DataKi:  13nM. Assay description: Binding affinity towards mouse Prostanoid EP2 receptor expressed in CHO cells.
In DepthDetails ArticlePubMed
TargetProstaglandin E2 receptor EP1 subtype(Mus musculus (Mouse))
Minase Research Institute
Curated by ChEMBL
LigandPNGBDBM50101820((Z)-7-{(1R,2R,3R,5S)-5-Chloro-2-[(E)-(S)-4-(1-ethy...)
Affinity DataKi: >1.00E+4nM. Assay description: Binding affinity towards mouse Prostanoid EP1 receptor in CHO cells.
In DepthDetails ArticlePubMed
TargetProstacyclin receptor(Homo sapiens (Human))
Minase Research Institute
Curated by ChEMBL
LigandPNGBDBM50101820((Z)-7-{(1R,2R,3R,5S)-5-Chloro-2-[(E)-(S)-4-(1-ethy...)
Affinity DataKi: >1.00E+4nM. Assay description: Binding affinity towards human Prostanoid IP receptor in CHO cells.
In DepthDetails ArticlePubMed
TargetProstaglandin E2 receptor EP3 subtype(Mus musculus (Mouse))
Minase Research Institute
Curated by ChEMBL
LigandPNGBDBM50101820((Z)-7-{(1R,2R,3R,5S)-5-Chloro-2-[(E)-(S)-4-(1-ethy...)
Affinity DataKi: >1.00E+4nM. Assay description: Binding affinity towards mouse Prostanoid EP3 receptor in CHO cells.
In DepthDetails ArticlePubMed
TargetProstaglandin E2 receptor EP4 subtype(Mus musculus (Mouse))
Minase Research Institute
Curated by ChEMBL
LigandPNGBDBM50101820((Z)-7-{(1R,2R,3R,5S)-5-Chloro-2-[(E)-(S)-4-(1-ethy...)
Affinity DataKi: >1.00E+4nM. Assay description: Binding affinity towards mouse Prostanoid EP4 receptor in CHO cells.
In DepthDetails ArticlePubMed
TargetProstaglandin E2 receptor EP2 subtype(Mus musculus (Mouse))
Minase Research Institute
Curated by ChEMBL
LigandPNGBDBM50101820((Z)-7-{(1R,2R,3R,5S)-5-Chloro-2-[(E)-(S)-4-(1-ethy...)
Affinity DataEC50:  39nM. Assay description: Binding affinity towards mouse Prostanoid EP2 receptor expressed in CHO cells.
In DepthDetails ArticlePubMed