BDBM50102699 2-[6-(2-Amino-benzylamino)-9-methyl-9H-purin-2-ylamino]-acetamide(YTB1)::CHEMBL89567
SMILES Cn1cnc2c(NCc3ccccc3N)nc(NCC(N)=O)nc12
InChI Key InChIKey=KPXFLAJORSPEJC-UHFFFAOYSA-N
Data  1 IC50
  Tab Delimited (TSV)   2D SDfile   Computed 3D by Vconf -m prep SDfile
Find this compound or compounds like it in BindingDB:
Activity Spreadsheet -- Enzyme Inhibition Constant Data from BindingDB
Found 1 hit for monomerid = 50102699
TargetSulfotransferase 1E1(Mus musculus)
University Of California
Curated by ChEMBL
LigandPNGBDBM50102699(2-[6-(2-Amino-benzylamino)-9-methyl-9H-purin-2-yla...)
Affinity DataIC50:  3.00E+4nM. Assay description: Inhibition of estrogen sulfotransferase (EST) in TLC radiolabel transfer assay
In DepthDetails ArticlePubMed