BDBM50103275 1-(4-Acetylamino-3-benzoyl-phenylcarbamoyl)-2-mercapto-ethyl-ammonium; chloride::CHEMBL95540
SMILES CC(=O)Nc1ccc(NC(=O)[C@@H]([NH3+])CS)cc1C(=O)c1ccccc1
InChI Key InChIKey=NTZOSJGKMMWKFD-HNNXBMFYSA-O
Data  1 IC50
  Tab Delimited (TSV)   2D SDfile   Computed 3D by Vconf -m prep SDfile
Find this compound or compounds like it in BindingDB:
Activity Spreadsheet -- Enzyme Inhibition Constant Data from BindingDB
Found 1 hit for monomerid = 50103275
TargetProtein farnesyltransferase subunit beta/geranylgeranyltransferase type-1 subunit alpha(Saccharomyces cerevisiae (Baker's yeast))
Philipps-UniversitäT Marburg
Curated by ChEMBL
LigandPNGBDBM50103275(1-(4-Acetylamino-3-benzoyl-phenylcarbamoyl)-2-merc...)
Affinity DataIC50:  7.60E+3nM. Assay description: Inhibitory activity against farnesyltransferase.
In DepthDetails ArticlePubMed