BDBM50103784 CHEMBL77638::Phosphoric acid mono-(4-{2-acetylamino-2-[(S)-1-(3-carbamoyl-4-cyclohexylmethoxy-phenyl)-ethylcarbamoyl]-ethyl}-phenyl) ester
SMILES C[C@H](NC(=O)C(Cc1ccc(OP(O)(O)=O)cc1)NC(C)=O)c1ccc(OCC2CCCCC2)c(c1)C(N)=O
InChI Key InChIKey=OLJMSXRNFOUYJF-KEJDIYNNSA-N
Data  3 IC50
  Tab Delimited (TSV)   2D SDfile   Computed 3D by Vconf -m prep SDfile
Find this compound or compounds like it in BindingDB:
Activity Spreadsheet -- Enzyme Inhibition Constant Data from BindingDB
Found 3 hits for monomerid = 50103784
TargetProto-oncogene tyrosine-protein kinase Src(Homo sapiens (Human))
Ariad Pharmaceuticals
Curated by ChEMBL
LigandPNGBDBM50103784(CHEMBL77638 | Phosphoric acid mono-(4-{2-acetylami...)
Affinity DataIC50:  2.70E+3nM. Assay description: Inhibition of binding to Src SH2 domain
In DepthDetails ArticlePubMed
TargetTyrosine-protein kinase ZAP-70(Homo sapiens (Human))
Ariad Pharmaceuticals
Curated by ChEMBL
LigandPNGBDBM50103784(CHEMBL77638 | Phosphoric acid mono-(4-{2-acetylami...)
Affinity DataIC50:  4.41E+5nM. Assay description: Inhibition of binding to Zap70 protein kinase
In DepthDetails ArticlePubMed
TargetTyrosine-protein kinase Yes(Homo sapiens (Human))
Ariad Pharmaceuticals
Curated by ChEMBL
LigandPNGBDBM50103784(CHEMBL77638 | Phosphoric acid mono-(4-{2-acetylami...)
Affinity DataIC50:  2.60E+3nM. Assay description: Inhibition of binding to Yes SH2 domain
In DepthDetails ArticlePubMed