BDBM50104048 CHEMBL106900::N-[3-Benzoyl-4-(2-p-tolyl-acetylamino)-phenyl]-4-phenyl-butyramide
SMILES Cc1ccc(CC(=O)Nc2ccc(NC(=O)CCCc3ccccc3)cc2C(=O)c2ccccc2)cc1
InChI Key InChIKey=NZZFTTUZHHXQNY-UHFFFAOYSA-N
Data  1 IC50
  Tab Delimited (TSV)   2D SDfile   Computed 3D by Vconf -m prep SDfile
Find this compound or compounds like it in BindingDB:
Activity Spreadsheet -- Enzyme Inhibition Constant Data from BindingDB
Found 1 hit for monomerid = 50104048
TargetProtein farnesyltransferase subunit beta/geranylgeranyltransferase type-1 subunit alpha(Saccharomyces cerevisiae (Baker's yeast))
Philipps-UniversitäT Marburg
Curated by ChEMBL
LigandPNGBDBM50104048(CHEMBL106900 | N-[3-Benzoyl-4-(2-p-tolyl-acetylami...)
Affinity DataIC50:  530nM. Assay description: Inhibitory activity against yeast farnesyltransferase
In DepthDetails ArticlePubMed