BDBM50104464 CHEMBL405650::Phosphoric acid 12-[(S)-2-[(S)-2-amino-3-(1H-indol-2-yl)-propionylamino]-3-(1H-indol-3-yl)-propionylamino]-dodecyl ester 2-chloro-phenyl ester; compound with triethyl-amine
SMILES N[C@@H](Cc1cc2ccccc2[nH]1)C(=O)N[C@@H](Cc1c[nH]c2ccccc12)C(=O)NCCCCCCCCCCCCOP(O)(=O)Oc1ccccc1Cl
InChI Key InChIKey=ODQFILDYJXXRLP-UNVMMQEESA-N
Data  1 IC50
  Tab Delimited (TSV)   2D SDfile   Computed 3D by Vconf -m prep SDfile
Find this compound or compounds like it in BindingDB:
Activity Spreadsheet -- Enzyme Inhibition Constant Data from BindingDB
Found 1 hit for monomerid = 50104464
TargetTelomerase reverse transcriptase(Homo sapiens (Human))
Kyushu University
Curated by ChEMBL
LigandPNGBDBM50104464(CHEMBL405650 | Phosphoric acid 12-[(S)-2-[(S)-2-am...)
Affinity DataIC50:  1.11E+4nM. Assay description: Inhibitory activity against telomerase extracted from HCT 116 cell lines
In DepthDetails ArticlePubMed