BDBM50104930 (Z)-{4-[(4-Bromo-phenyl)-methoxyimino-methyl]-[1,4']bipiperidinyl-1'-yl}-(2,6-dimethyl-phenyl)-methanone::CHEMBL112686
SMILES CO\N=C(/C1CCN(CC1)C1CCN(CC1)C(=O)c1c(C)cccc1C)c1ccc(Br)cc1
InChI Key InChIKey=KPCJAWUQEHHLIA-WCTVFOPTSA-N
Data  1 KI
  Tab Delimited (TSV)   2D SDfile   Computed 3D by Vconf -m prep SDfile
Find this compound or compounds like it in BindingDB:
Activity Spreadsheet -- Enzyme Inhibition Constant Data from BindingDB
Found 1 hit for monomerid = 50104930
TargetC-C chemokine receptor type 5(Homo sapiens (Human))
Schering-Plough Research Institute
Curated by ChEMBL
LigandPNGBDBM50104930((Z)-{4-[(4-Bromo-phenyl)-methoxyimino-methyl]-[1,4...)
Affinity DataKi:  2nM. Assay description: Inhibition of RANTES binding to C-C chemokine receptor type 5
In DepthDetails ArticlePubMed