BDBM50105276 CHEMBL3597698
SMILES Brc1cccc(c1)[C@@H]1C[C@H](c2cccc(Br)c2)n2nnnc2N1
InChI Key InChIKey=JHRYBPMSBXHLJL-LSDHHAIUSA-N
Data  2 IC50  1 Kd
PDB links: 1 PDB ID matches this monomer.
  Tab Delimited (TSV)   2D SDfile   Computed 3D by Vconf -m prep SDfile
Find this compound or compounds like it in BindingDB:
Activity Spreadsheet -- Enzyme Inhibition Constant Data from BindingDB
Found 2 hits for monomerid = 50105276
TargetEndothelial PAS domain-containing protein 1/Hypoxia-inducible factor 1-alpha(Homo sapiens (Human))
University Of Texas Southwestern Medical Center
Curated by ChEMBL
LigandPNGBDBM50105276(CHEMBL3597698)
Affinity DataIC50: >3.00E+4nM. Assay description: Binding affinity to wild type GST-tagged HIF-2alpha PAS-B S304M mutant (240 to 350) (unknown origin) expressed in Escherichia coli assessed as inhibi...
TargetEndothelial PAS domain-containing protein 1(Homo sapiens (Human))
University Of Texas Southwestern Medical Center
Curated by ChEMBL
LigandPNGBDBM50105276(CHEMBL3597698)
Affinity DataIC50:  112nM. Assay description: Binding affinity to wild type GST-tagged HIF-2alpha PAS-B (240 to 350) (unknown origin) expressed in Escherichia coli assessed as inhibition of inter...