BDBM50106452 3-(1-Benzoyl-1H-indol-3-ylmethylene)-1-benzyl-piperidin-4-one::CHEMBL130831
SMILES O=C(c1ccccc1)n1cc(C=C2CN(Cc3ccccc3)CCC2=O)c2ccccc12
InChI Key InChIKey=VOQCKSNAVPGHAM-UHFFFAOYSA-N
Data  1 IC50
  Tab Delimited (TSV)   2D SDfile   Computed 3D by Vconf -m prep SDfile
Find this compound or compounds like it in BindingDB:
Activity Spreadsheet -- Enzyme Inhibition Constant Data from BindingDB
Found 1 hit for monomerid = 50106452
TargetAcetylcholinesterase(Homo sapiens (Human))
Università
Curated by ChEMBL
LigandPNGBDBM50106452(3-(1-Benzoyl-1H-indol-3-ylmethylene)-1-benzyl-pipe...)
Affinity DataIC50:  7.00E+4nM. Assay description: Inhibitory concentration required against acetylcholinesterase activity
In DepthDetails ArticlePubMed