BDBM50106455 3-(1-Benzoyl-1H-pyrrol-3-ylmethylene)-1-benzyl-piperidin-4-one::CHEMBL128172
SMILES O=C1CCN(Cc2ccccc2)CC1=Cc1c[nH]c2ccccc12
InChI Key InChIKey=ZPMXWGBWYLLQKG-UHFFFAOYSA-N
Data  2 IC50
  Tab Delimited (TSV)   2D SDfile   Computed 3D by Vconf -m prep SDfile
Find this compound or compounds like it in BindingDB:
Activity Spreadsheet -- Enzyme Inhibition Constant Data from BindingDB
Found 2 hits for monomerid = 50106455
TargetAcetylcholinesterase(Electrophorus electricus (Electric eel))
Punjabi University
Curated by ChEMBL
LigandPNGBDBM50106455(3-(1-Benzoyl-1H-pyrrol-3-ylmethylene)-1-benzyl-pip...)
Affinity DataIC50:  8.00E+3nM. Assay description: Inhibition of electric eel acetylcholinesterase using acetylcholine chloride as substrate measured every 1 min by chemiluminescent assay
In DepthDetails ArticlePubMed
TargetAcetylcholinesterase(Homo sapiens (Human))
Università
Curated by ChEMBL
LigandPNGBDBM50106455(3-(1-Benzoyl-1H-pyrrol-3-ylmethylene)-1-benzyl-pip...)
Affinity DataIC50:  8.00E+3nM. Assay description: Inhibitory concentration required against acetylcholinesterase activity
In DepthDetails ArticlePubMed