BDBM50107020 CHEMBL105782::N-(4-Methyl-benzoyl)-N'-(3,4,5-trimethoxy-phenyl)-guanidine
SMILES COc1cc(cc(OC)c1OC)N=C(N)NC(=O)c1ccc(C)cc1
InChI Key InChIKey=OERUPTYNADMLHW-UHFFFAOYSA-N
Data  2 IC50
  Tab Delimited (TSV)   2D SDfile   Computed 3D by Vconf -m prep SDfile
Find this compound or compounds like it in BindingDB:
Activity Spreadsheet -- Enzyme Inhibition Constant Data from BindingDB
Found 2 hits for monomerid = 50107020
TargetSodium channel protein type 2 subunit alpha(Homo sapiens (Human))
Cenes Pharmaceuticals
Curated by ChEMBL
LigandPNGBDBM50107020(CHEMBL105782 | N-(4-Methyl-benzoyl)-N'-(3,4,5-trim...)
Affinity DataIC50:  1.92E+3nM. Assay description: Inhibition of sodium channel blockade in CHO cells expressing neuronal mammalian type IIA (CNaIIA) sodium channel
In DepthDetails ArticlePubMed
TargetSodium channel protein type 5 subunit alpha(Homo sapiens (Human))
Cenes Pharmaceuticals
Curated by ChEMBL
LigandPNGBDBM50107020(CHEMBL105782 | N-(4-Methyl-benzoyl)-N'-(3,4,5-trim...)
Affinity DataIC50:  2.44E+4nM. Assay description: Inhibition of sodium channel blockade in CHO cells expressing human cardiac (hHI) sodium channel
In DepthDetails ArticlePubMed