BDBM50107035 CHEMBL320332::N-[2-(4-Chloro-phenyl)-ethyl]-N'-(4-methyl-benzoyl)-guanidine
SMILES Cc1ccc(cc1)C(=O)NC(N)=NCCc1ccc(Cl)cc1
InChI Key InChIKey=BKOQLVIAQSTBSY-UHFFFAOYSA-N
Data  2 IC50
  Tab Delimited (TSV)   2D SDfile   Computed 3D by Vconf -m prep SDfile
Find this compound or compounds like it in BindingDB:
Activity Spreadsheet -- Enzyme Inhibition Constant Data from BindingDB
Found 2 hits for monomerid = 50107035
TargetSodium channel protein type 2 subunit alpha(Homo sapiens (Human))
Cenes Pharmaceuticals
Curated by ChEMBL
LigandPNGBDBM50107035(CHEMBL320332 | N-[2-(4-Chloro-phenyl)-ethyl]-N'-(4...)
Affinity DataIC50:  1.97E+3nM. Assay description: Inhibition of sodium channel blockade in CHO cells expressing neuronal mammalian type IIA (CNaIIA) sodium channel
In DepthDetails ArticlePubMed
TargetSodium channel protein type 5 subunit alpha(Homo sapiens (Human))
Cenes Pharmaceuticals
Curated by ChEMBL
LigandPNGBDBM50107035(CHEMBL320332 | N-[2-(4-Chloro-phenyl)-ethyl]-N'-(4...)
Affinity DataIC50:  8.50E+3nM. Assay description: Inhibition of sodium channel blockade in CHO cells expressing human cardiac (hHI) sodium channel
In DepthDetails ArticlePubMed