BDBM50107642 CHEMBL440347::Pentanoic acid [1-(cyanomethyl-carbamoyl)-2-m-tolyl-ethyl]-amide
SMILES CCCCC(=O)N[C@@H](Cc1cccc(C)c1)C(=O)NCC#N
InChI Key InChIKey=JFDYFDXKOSUPJK-HNNXBMFYSA-N
Data  1 IC50
  Tab Delimited (TSV)   2D SDfile   Computed 3D by Vconf -m prep SDfile
Find this compound or compounds like it in BindingDB:
Activity Spreadsheet -- Enzyme Inhibition Constant Data from BindingDB
Found 1 hit for monomerid = 50107642
TargetCathepsin B(Homo sapiens (Human))
Novartis Pharmaceuticals
Curated by ChEMBL
LigandPNGBDBM50107642(CHEMBL440347 | Pentanoic acid [1-(cyanomethyl-carb...)
Affinity DataIC50:  3.00E+3nM. Assay description: Inhibitiory activity against recombinant human cathepsin B (cat B) expressed in baculovirus.
In DepthDetails ArticlePubMed