BDBM50108487 (3R,6S,9S)-9-(4-Amino-butyl)-1-[(S)-2-amino-3-(4-hydroxy-phenyl)-propionyl]-6-benzyl-3-isopropyl-[1,4,7]triazonane-2,5,8-trione::CHEMBL307133
SMILES CC(C)[C@H]1NC(=O)[C@H](Cc2ccccc2)NC(=O)[C@H](CCCCN)N(C(=O)[C@@H](N)Cc2ccc(O)cc2)C1=O
InChI Key InChIKey=ATWURJJJKREKHL-OJJQZRKESA-N
Data  2 IC50
  Tab Delimited (TSV)   2D SDfile   Computed 3D by Vconf -m prep SDfile
Find this compound or compounds like it in BindingDB:
Activity Spreadsheet -- Enzyme Inhibition Constant Data from BindingDB
Found 2 hits for monomerid = 50108487
TargetDelta-type opioid receptor(MOUSE)
University Of Louisville
Curated by ChEMBL
LigandPNGBDBM50108487((3R,6S,9S)-9-(4-Amino-butyl)-1-[(S)-2-amino-3-(4-h...)
Affinity DataIC50:  0.440nM. Assay description: Concentration required for 50% inhibition of electrically induced contraction of the mouse vas deferens mediated through delta opioid receptor
In DepthDetails ArticlePubMed
TargetMu-type opioid receptor(GUINEA PIG)
University Of Louisville
Curated by ChEMBL
LigandPNGBDBM50108487((3R,6S,9S)-9-(4-Amino-butyl)-1-[(S)-2-amino-3-(4-h...)
Affinity DataIC50:  0.200nM. Assay description: Concentration required for 50% inhibition of electrically induced contraction of the guinea pig ileum mediated through mu opioid receptor
In DepthDetails ArticlePubMed