BDBM50109885 CHEMBL3604302
SMILES [Cl-].Cc1c(CNC(=O)c2ccc(Cl)cc2)c2CCC[n+]2c(C)c1CNC(=O)c1ccc(Cl)cc1
InChI Key InChIKey=AQMCDAYVDQDHDT-UHFFFAOYSA-N
Data  1 IC50
  Tab Delimited (TSV)   2D SDfile   Computed 3D by Vconf -m prep SDfile
Find this compound or compounds like it in BindingDB:
Activity Spreadsheet -- Enzyme Inhibition Constant Data from BindingDB
Found 1 hit for monomerid = 50109885
TargetC-C chemokine receptor type 5(Homo sapiens (Human))
Virginia Commonwealth University
Curated by ChEMBL
LigandPNGBDBM50109885(CHEMBL3604302)
Affinity DataIC50:  4.62E+4nM. Assay description: Antagonist activity at CCR5 (unknown origin) expressed in human MOLT4 cells assessed as inhibition of CCL5-induced calcium mobilization after 1 hr
In DepthDetails ArticlePubMed