BDBM50112679 2-Benzo[1,3]dioxol-5-yl-4-pentyloxy-2H-chromene-3-carboxylic acid::CHEMBL293702
SMILES CCCCCOC1=C(C(Oc2ccccc12)c1ccc2OCOc2c1)C(O)=O
InChI Key InChIKey=ARAWMFVXKCGSKN-UHFFFAOYSA-N
Data  3 IC50
  Tab Delimited (TSV)   2D SDfile   Computed 3D by Vconf -m prep SDfile
Find this compound or compounds like it in BindingDB:
Activity Spreadsheet -- Enzyme Inhibition Constant Data from BindingDB
Found 3 hits for monomerid = 50112679
TargetEndothelin-1 receptor(RAT)
Shionogi
Curated by ChEMBL
LigandPNGBDBM50112679(2-Benzo[1,3]dioxol-5-yl-4-pentyloxy-2H-chromene-3-...)
Affinity DataIC50:  29nM. Assay description: Binding affinity for endothelin A receptor by inhibition of [125I]-ET-1 binding in rat aorta smooth muscle cells
In DepthDetails ArticlePubMed
TargetEndothelin-1 receptor(RAT)
Shionogi
Curated by ChEMBL
LigandPNGBDBM50112679(2-Benzo[1,3]dioxol-5-yl-4-pentyloxy-2H-chromene-3-...)
Affinity DataIC50:  29nM. Assay description: Ability to displace [125I]-ET-1 from the rat endothelin A receptor expressed in rat aorta smooth muscle cells.
In DepthDetails ArticlePubMed
TargetEndothelin receptor type B(Sus scrofa)
Shionogi
Curated by ChEMBL
LigandPNGBDBM50112679(2-Benzo[1,3]dioxol-5-yl-4-pentyloxy-2H-chromene-3-...)
Affinity DataIC50:  1.10E+3nM. Assay description: Binding affinity to endothelin B receptor measured by inhibition of [125I]-ET-3 binding recombinant pig ET-B receptor expressed in COS-7 cells
In DepthDetails ArticlePubMed