BDBM50112836 2-Benzoyl-N-(1-benzyl-2-oxo-ethyl)-benzamide::CHEMBL28444
SMILES O=CC(Cc1ccccc1)NC(=O)c1ccccc1C(=O)c1ccccc1
InChI Key InChIKey=OADFRIGJRBCGII-UHFFFAOYSA-N
Data  1 KI
  Tab Delimited (TSV)   2D SDfile   Computed 3D by Vconf -m prep SDfile
Find this compound or compounds like it in BindingDB:
Activity Spreadsheet -- Enzyme Inhibition Constant Data from BindingDB
Found 1 hit for monomerid = 50112836
TargetCalpain-1 catalytic subunit(Homo sapiens (Human))
Abbott
Curated by ChEMBL
LigandPNGBDBM50112836(2-Benzoyl-N-(1-benzyl-2-oxo-ethyl)-benzamide | CHE...)
Affinity DataKi:  230nM. Assay description: Inhibition of calpain, using human mu-calpain isolated from erythrocytes and Suc-Leu-Tyr-AMC as the fluorogenic substrate
In DepthDetails ArticlePubMed